Target
Cathepsin G
Ligand
BDBM50005892
Substrate
Meas. Tech.
ChEBML_45341
IC50
>60000±n/a nM
Citation
 Zembower, DEKam, CMPowers, JCZalkow, LH Novel anthraquinone inhibitors of human leukocyte elastase and cathepsin G. J Med Chem 35:1597-605 (1992)  
Target
Name:
Cathepsin G
Synonyms:
CATG_HUMAN CTSG
Type:
PROTEIN
Mol. Mass.:
28860.08
Organism:
Homo sapiens (Human)
Description:
ChEMBL_1469016
Residue:
255
  
Inhibitor
Name:
BDBM50005892
Synonyms:
1-Hydroxy-8-methoxy-2-propyl-anthraquinone | CHEMBL289034
Type:
Small organic molecule
Emp. Form.:
C18H16O4
Mol. Mass.:
296.3172
SMILES:
CCCc1ccc2C(=O)c3cccc(OC)c3C(=O)c2c1O
: