Target
Acyl-CoA:cholesterol acyltransferase
Ligand
BDBM50005947
Substrate
Meas. Tech.
ChEBML_28339
IC50
>5000±n/a nM
Citation
 Roth, BDBlankley, CJHoefle, MLHolmes, ARoark, WHTrivedi, BKEssenburg, ADKieft, KAKrause, BRStanfield, RL Inhibitors of acyl-CoA:cholesterol acyltransferase. 1. Identification and structure-activity relationships of a novel series of fatty acid anilide hypocholesterolemic agents. J Med Chem 35:1609-17 (1992)  
Target
Name:
Acyl-CoA:cholesterol acyltransferase
Synonyms:
ACAT
Type:
Mol. Mass.:
35405.31
Organism:
Oryctolagus cuniculus
Description:
Residue:
305
  
Inhibitor
Name:
BDBM50005947
Synonyms:
2-Methyl-3-octadec-9-enoylamino-benzoic acid methyl ester | CHEMBL295227
Type:
Small organic molecule
Emp. Form.:
C27H43NO3
Mol. Mass.:
429.6352
SMILES:
CCCCCCCC\C=C\CCCCCCCC(=O)Nc1cccc(C(=O)OC)c1C
: