Target
Acyl-CoA:cholesterol acyltransferase
Ligand
BDBM50005948
Substrate
Meas. Tech.
ChEBML_28339
IC50
2300±n/a nM
Citation
 Roth, BDBlankley, CJHoefle, MLHolmes, ARoark, WHTrivedi, BKEssenburg, ADKieft, KAKrause, BRStanfield, RL Inhibitors of acyl-CoA:cholesterol acyltransferase. 1. Identification and structure-activity relationships of a novel series of fatty acid anilide hypocholesterolemic agents. J Med Chem 35:1609-17 (1992)  
Target
Name:
Acyl-CoA:cholesterol acyltransferase
Synonyms:
ACAT
Type:
Mol. Mass.:
35405.31
Organism:
Oryctolagus cuniculus
Description:
Residue:
305
  
Inhibitor
Name:
BDBM50005948
Synonyms:
CHEMBL42575 | [2-(2,2-Dimethyl-dodecanoylamino)-3,5-dimethoxy-phenoxy]-acetic acid methyl ester
Type:
Small organic molecule
Emp. Form.:
C25H41NO6
Mol. Mass.:
451.5961
SMILES:
CCCCCCCCCCC(C)(C)C(=O)Nc1c(OC)cc(OC)cc1OCC(=O)OC
: