Target
Platelet-activating factor receptor
Ligand
BDBM50006083
Substrate
Meas. Tech.
ChEBML_221704
IC50
3910±n/a nM
Citation
 Wissner, ACarroll, MLGreen, KEKerwar, SSPickett, WCSchaub, RETorley, LWWrenn, SKohler, CA Analogues of platelet activating factor. 6. Mono- and bis-aryl phosphate antagonists of platelet activating factor. J Med Chem 35:1650-62 (1992)  
Target
Name:
Platelet-activating factor receptor
Synonyms:
PAF-R PTAFR_CAVPO Platelet-activating factor receptor
Type:
Protein
Mol. Mass.:
39005.63
Organism:
Cavia porcellus
Description:
Residue:
342
  
Inhibitor
Name:
BDBM50006083
Synonyms:
3-{4-[(3-Hexadecyloxy-2-methoxy-propoxy)-hydroxy-phosphoryloxy]-benzyl}-thiazol-3-ium | CHEMBL430741
Type:
Small organic molecule
Emp. Form.:
C30H50NO6PS
Mol. Mass.:
583.76
SMILES:
CCCCCCCCCCCCCCCCOCC(COP([O-])(=O)Oc1ccc(C[n+]2ccsc2)cc1)OC
: