Target
Platelet-activating factor receptor
Ligand
BDBM50006025
Substrate
Meas. Tech.
ChEBML_221704
IC50
13600±n/a nM
Citation
 Wissner, ACarroll, MLGreen, KEKerwar, SSPickett, WCSchaub, RETorley, LWWrenn, SKohler, CA Analogues of platelet activating factor. 6. Mono- and bis-aryl phosphate antagonists of platelet activating factor. J Med Chem 35:1650-62 (1992)  
Target
Name:
Platelet-activating factor receptor
Synonyms:
PAF-R PTAFR_CAVPO Platelet-activating factor receptor
Type:
Protein
Mol. Mass.:
39005.63
Organism:
Cavia porcellus
Description:
Residue:
342
  
Inhibitor
Name:
BDBM50006025
Synonyms:
CHEMBL295434 | {3-[(3-Hexadecyloxy-2-methoxy-propoxy)-hydroxy-phosphoryloxy]-benzyl}-triphenyl-phosphonium; bromide
Type:
Small organic molecule
Emp. Form.:
C45H63O6P2
Mol. Mass.:
761.9251
SMILES:
CCCCCCCCCCCCCCCCOCC(COP(O)(=O)Oc1cccc(C[P+](c2ccccc2)(c2ccccc2)c2ccccc2)c1)OC
: