Target
Platelet-activating factor receptor
Ligand
BDBM50006028
Substrate
Meas. Tech.
ChEBML_221704
IC50
2160±n/a nM
Citation
 Wissner, ACarroll, MLGreen, KEKerwar, SSPickett, WCSchaub, RETorley, LWWrenn, SKohler, CA Analogues of platelet activating factor. 6. Mono- and bis-aryl phosphate antagonists of platelet activating factor. J Med Chem 35:1650-62 (1992)  
Target
Name:
Platelet-activating factor receptor
Synonyms:
PAF-R PTAFR_CAVPO Platelet-activating factor receptor
Type:
Protein
Mol. Mass.:
39005.63
Organism:
Cavia porcellus
Description:
Residue:
342
  
Inhibitor
Name:
BDBM50006028
Synonyms:
3-{3-[Hydroxy-(6-tetradecyloxy-biphenyl-3-yloxy)-phosphoryloxy]-benzyl}-5-methyl-thiazol-3-ium | CHEMBL47149
Type:
Small organic molecule
Emp. Form.:
C37H48NO5PS
Mol. Mass.:
649.819
SMILES:
CCCCCCCCCCCCCCOc1ccc(OP([O-])(=O)Oc2cccc(C[n+]3csc(C)c3)c2)cc1-c1ccccc1
: