Target
Platelet-activating factor receptor
Ligand
BDBM50006057
Substrate
Meas. Tech.
ChEBML_221704
IC50
9080±n/a nM
Citation
 Wissner, ACarroll, MLGreen, KEKerwar, SSPickett, WCSchaub, RETorley, LWWrenn, SKohler, CA Analogues of platelet activating factor. 6. Mono- and bis-aryl phosphate antagonists of platelet activating factor. J Med Chem 35:1650-62 (1992)  
Target
Name:
Platelet-activating factor receptor
Synonyms:
PAF-R PTAFR_CAVPO Platelet-activating factor receptor
Type:
Protein
Mol. Mass.:
39005.63
Organism:
Cavia porcellus
Description:
Residue:
342
  
Inhibitor
Name:
BDBM50006057
Synonyms:
3-(3-{[3-(3-Hexadecyloxy-phenoxy)-2-methoxy-propoxy]-hydroxy-phosphoryloxy}-benzyl)-thiazol-3-ium | CHEMBL46375
Type:
Small organic molecule
Emp. Form.:
C36H54NO7PS
Mol. Mass.:
675.855
SMILES:
CCCCCCCCCCCCCCCCOc1cccc(OCC(COP([O-])(=O)Oc2cccc(C[n+]3ccsc3)c2)OC)c1
: