Target
D(2) dopamine receptor
Ligand
BDBM50455996
Substrate
Meas. Tech.
ChEBML_62562
Ki
259±n/a nM
Citation
 Chidester, CGLin, CHLahti, RAHaadsma-Svensson, SRSmith, MW Comparison of 5-HT1A and dopamine D2 pharmacophores. X-ray structures and affinities of conformationally constrained ligands. J Med Chem 36:1301-15 (1993)  
Target
Name:
D(2) dopamine receptor
Synonyms:
DOPAMINE D2 DOPAMINE D2 Short Dopamine D2 receptor Drd2
Type:
G Protein-Coupled Receptor (GPCR)
Mol. Mass.:
50931.60
Organism:
Rattus norvegicus (rat)
Description:
P61169
Residue:
444
  
Inhibitor
Name:
BDBM50455996
Synonyms:
CHEMBL566133
Type:
Small organic molecule
Emp. Form.:
C15H19NO
Mol. Mass.:
229.3175
SMILES:
[H][C@]12CCc3c(O)cccc3[C@@]1([H])CCN2CC=C
: