Target
5-hydroxytryptamine receptor 1A
Ligand
BDBM50034352
Substrate
Meas. Tech.
ChEBML_581
Ki
36±n/a nM
Citation
 Chidester, CGLin, CHLahti, RAHaadsma-Svensson, SRSmith, MW Comparison of 5-HT1A and dopamine D2 pharmacophores. X-ray structures and affinities of conformationally constrained ligands. J Med Chem 36:1301-15 (1993)  
Target
Name:
5-hydroxytryptamine receptor 1A
Synonyms:
5-HT-1A 5-hydroxytryptamine receptor 1A (5-HT-1A) ADRB2RL1 Dopamine D2 receptor and serotonin 1a receptor HTR1A | Serotonin receptor 1A
Type:
Mol. Mass.:
46122.49
Organism:
Homo sapiens (Human)
Description:
Residue:
422
  
Inhibitor
Name:
BDBM50034352
Synonyms:
(3aS,9aR) 1-Propyl-2,3,3a,4,9,9a-hexahydro-1H-benzo[f]indol-5-ol 1-Propyl-2,3,3a,4,9,9a-hexahydro-1H-benzo[f]indol-5-ol | CHEMBL11066
Type:
Small organic molecule
Emp. Form.:
C15H21NO
Mol. Mass.:
231.3333
SMILES:
CCCN1CC[C@@H]2Cc3c(O)cccc3C[C@@H]12
: