Target
5-hydroxytryptamine receptor 1A
Ligand
BDBM50034348
Substrate
Meas. Tech.
ChEBML_581
Ki
0.300000±n/a nM
Citation
 Chidester, CGLin, CHLahti, RAHaadsma-Svensson, SRSmith, MW Comparison of 5-HT1A and dopamine D2 pharmacophores. X-ray structures and affinities of conformationally constrained ligands. J Med Chem 36:1301-15 (1993)  
Target
Name:
5-hydroxytryptamine receptor 1A
Synonyms:
5-HT-1A 5-hydroxytryptamine receptor 1A (5-HT-1A) ADRB2RL1 Dopamine D2 receptor and serotonin 1a receptor HTR1A | Serotonin receptor 1A
Type:
Mol. Mass.:
46122.49
Organism:
Homo sapiens (Human)
Description:
Residue:
422
  
Inhibitor
Name:
BDBM50034348
Synonyms:
(2aR,8bR)-2-Allyl-1,2,2a,3,4,8b-hexahydro-naphtho[2,1-b]azet-8-ol (Recemic)2-Allyl-1,2,2a,3,4,8b-hexahydro-naphtho[2,1-b]azet-8-ol | CHEMBL285774
Type:
Small organic molecule
Emp. Form.:
C14H17NO
Mol. Mass.:
215.2909
SMILES:
Oc1cccc2CC[C@@H]3[C@@H](CN3CC=C)c12
: