Target
D(2) dopamine receptor
Ligand
BDBM50040170
Substrate
Meas. Tech.
ChEBML_62562
Ki
42±n/a nM
Citation
 Chidester, CGLin, CHLahti, RAHaadsma-Svensson, SRSmith, MW Comparison of 5-HT1A and dopamine D2 pharmacophores. X-ray structures and affinities of conformationally constrained ligands. J Med Chem 36:1301-15 (1993)  
Target
Name:
D(2) dopamine receptor
Synonyms:
DOPAMINE D2 DOPAMINE D2 Short Dopamine D2 receptor Drd2
Type:
G Protein-Coupled Receptor (GPCR)
Mol. Mass.:
50931.60
Organism:
Rattus norvegicus (rat)
Description:
P61169
Residue:
444
  
Inhibitor
Name:
BDBM50040170
Synonyms:
(Recemic)3-Allyl-6-methoxy-2,3,3a,4,5,9b-hexahydro-1H-benzo[e]indole CHEMBL10570
Type:
Small organic molecule
Emp. Form.:
C16H21NO
Mol. Mass.:
243.344
SMILES:
COc1cccc2C3CCN(CC=C)[C@@H]3CCc12
: