Target
D(2) dopamine receptor
Ligand
BDBM50034324
Substrate
Meas. Tech.
ChEBML_59890
Ki
75±n/a nM
Citation
 Chidester, CGLin, CHLahti, RAHaadsma-Svensson, SRSmith, MW Comparison of 5-HT1A and dopamine D2 pharmacophores. X-ray structures and affinities of conformationally constrained ligands. J Med Chem 36:1301-15 (1993)  
Target
Name:
D(2) dopamine receptor
Synonyms:
D(2) dopamine receptor DOPAMINE D2 Long DRD2 Dopamine D2 receptor Dopamine D2 receptor (D2R) Dopamine2-like | d2
Type:
Cell-surface receptors
Mol. Mass.:
50647.10
Organism:
Homo sapiens (Human)
Description:
P14416
Residue:
443
  
Inhibitor
Name:
BDBM50034324
Synonyms:
(3aS,9aR) 5-Methoxy-1-propyl-2,3,3a,4,9,9a-hexahydro-1H-benzo[f]indole 5-Methoxy-1-propyl-2,3,3a,4,9,9a-hexahydro-1H-benzo[f]indole | CHEMBL11388
Type:
Small organic molecule
Emp. Form.:
C16H23NO
Mol. Mass.:
245.3599
SMILES:
CCCN1CC[C@@H]2Cc3c(C[C@@H]12)cccc3OC
: