Target
5-hydroxytryptamine receptor 1A
Ligand
BDBM50034323
Substrate
Meas. Tech.
ChEBML_581
Ki
11±n/a nM
Citation
 Chidester, CGLin, CHLahti, RAHaadsma-Svensson, SRSmith, MW Comparison of 5-HT1A and dopamine D2 pharmacophores. X-ray structures and affinities of conformationally constrained ligands. J Med Chem 36:1301-15 (1993)  
Target
Name:
5-hydroxytryptamine receptor 1A
Synonyms:
5-HT-1A 5-hydroxytryptamine receptor 1A (5-HT-1A) ADRB2RL1 Dopamine D2 receptor and serotonin 1a receptor HTR1A | Serotonin receptor 1A
Type:
Mol. Mass.:
46122.49
Organism:
Homo sapiens (Human)
Description:
Residue:
422
  
Inhibitor
Name:
BDBM50034323
Synonyms:
(2 beta-methyl) 8-Methoxy-2-methyl-1-propyl-2,3,3a,4,9,9a-hexahydro-1H-benzo[f]indole 8-Methoxy-2-methyl-1-propyl-2,3,3a,4,9,9a-hexahydro-1H-benzo[f]indole | CHEMBL11386
Type:
Small organic molecule
Emp. Form.:
C17H25NO
Mol. Mass.:
259.3865
SMILES:
CCCN1[C@@H](C)C[C@@H]2Cc3cccc(OC)c3C[C@H]12
: