Target
D(2) dopamine receptor
Ligand
BDBM50020222
Substrate
Meas. Tech.
ChEBML_63049
Ki
142±n/a nM
Citation
 Foulon, CKung, MPKung, HF Synthesis of (R,S)-2'-trans-7-hydroxy-2-[N-n-propyl-N-(3'-iodo-2'- propenyl)-amino]tetralin (trans-7-OH-PIPAT): a new D3 dopamine receptor ligand. J Med Chem 36:1499-500 (1993)  
Target
Name:
D(2) dopamine receptor
Synonyms:
DOPAMINE D2 DOPAMINE D2 Short Dopamine D2 receptor Drd2
Type:
G Protein-Coupled Receptor (GPCR)
Mol. Mass.:
50931.60
Organism:
Rattus norvegicus (rat)
Description:
P61169
Residue:
444
  
Inhibitor
Name:
BDBM50020222
Synonyms:
(+/-)-7-(dipropylamino)-5,6,7,8-tetrahydronaphthalen-2-ol (R,S) 7-Dipropylamino-5,6,7,8-tetrahydro-naphthalen-2-ol 7-Dipropylamino-5,6,7,8-tetrahydro-naphthalen-2-ol 7-OH-DPAT 7-OH-DPAT,(-) CHEMBL1255966 | CHEMBL285755
Type:
Small organic molecule
Emp. Form.:
C16H25NO
Mol. Mass.:
247.3758
SMILES:
CCCN(CCC)C1CCc2ccc(O)cc2C1
: