Target
Kappa-type opioid receptor
Ligand
BDBM50045183
Substrate
Meas. Tech.
ChEBML_145680
IC50
15±n/a nM
Citation
 Naylor, AJudd, DBLloyd, JEScopes, DIHayes, AGBirch, PJ A potent new class of kappa-receptor agonist: 4-substituted 1-(arylacetyl)-2-[(dialkylamino)methyl]piperazines. J Med Chem 36:2075-83 (1993)  
Target
Name:
Kappa-type opioid receptor
Synonyms:
K-OR-1 Kappa-opioid receptor (KOR) Kappa-type opioid receptor (KOR) OPIATE Kappa OPRK1 kappa opioid receptor (KOR)
Type:
G Protein-Coupled Receptor (GPCR)
Mol. Mass.:
42648.76
Organism:
Homo sapiens (Human)
Description:
P41145
Residue:
380
  
Inhibitor
Name:
BDBM50045183
Synonyms:
4-[2-(3,4-Dichloro-phenyl)-acetyl]-3-pyrrolidin-1-ylmethyl-piperazine-1-carbaldehyde | CHEMBL62567
Type:
Small organic molecule
Emp. Form.:
C18H23Cl2N3O2
Mol. Mass.:
384.3
SMILES:
Clc1ccc(CC(=O)N2CCN(CC2CN2CCCC2)C=O)cc1Cl
: