Target
Kappa-type opioid receptor
Ligand
BDBM50045192
Substrate
Meas. Tech.
ChEBML_145680
IC50
0.040000±n/a nM
Citation
 Naylor, AJudd, DBLloyd, JEScopes, DIHayes, AGBirch, PJ A potent new class of kappa-receptor agonist: 4-substituted 1-(arylacetyl)-2-[(dialkylamino)methyl]piperazines. J Med Chem 36:2075-83 (1993)  
Target
Name:
Kappa-type opioid receptor
Synonyms:
K-OR-1 Kappa-opioid receptor (KOR) Kappa-type opioid receptor (KOR) OPIATE Kappa OPRK1 kappa opioid receptor (KOR)
Type:
G Protein-Coupled Receptor (GPCR)
Mol. Mass.:
42648.76
Organism:
Homo sapiens (Human)
Description:
P41145
Residue:
380
  
Inhibitor
Name:
BDBM50045192
Synonyms:
4-[2-(3,4-Dichloro-phenyl)-acetyl]-3-(3,6-dihydro-2H-pyridin-1-ylmethyl)-piperazine-1-carboxylic acid methyl ester | CHEMBL62474
Type:
Small organic molecule
Emp. Form.:
C20H25Cl2N3O3
Mol. Mass.:
426.337
SMILES:
COC(=O)N1CCN(C(CN2CCC=CC2)C1)C(=O)Cc1ccc(Cl)c(Cl)c1
: