Target
Gag-Pol polyprotein [489-587]
Ligand
BDBM50230843
Substrate
Meas. Tech.
ChEMBL_159976 (CHEMBL768123)
Ki
<1±n/a nM
Citation
 Caflisch, AMiranker, AKarplus, M Multiple copy simultaneous search and construction of ligands in binding sites: application to inhibitors of HIV-1 aspartic proteinase. J Med Chem 36:2142-67 (1993)  
Target
Name:
Gag-Pol polyprotein [489-587]
Synonyms:
Human immunodeficiency virus type 1 protease Pol polyprotein | gag-pol
Type:
Enzyme Subunit
Mol. Mass.:
10781.16
Organism:
Human immunodeficiency virus type 1
Description:
P04585[489-587]
Residue:
99
  
Inhibitor
Name:
BDBM50230843
Synonyms:
CHEMBL2062130 | U-85548E
Type:
Small organic molecule
Emp. Form.:
C40H73N9O12
Mol. Mass.:
872.0607
SMILES:
CC[C@H](C)[C@H](NC(=O)[C@@H](C[C@H](O)[C@H](CC(C)C)NC(=O)[C@H](CC(N)=O)NC(=O)[C@H](CCC(N)=O)NC(=O)[C@H](CO)NC(=O)[C@@H](N)C(C)C)C(C)C)C(=O)N[C@@H](C(C)C)C(O)=O
: