Target
Type-1 angiotensin II receptor
Ligand
BDBM50044405
Substrate
Meas. Tech.
ChEBML_36170
IC50
190±n/a nM
Citation
 Kubo, KKohara, YImamiya, ESugiura, YInada, YFurukawa, YNishikawa, KNaka, T Nonpeptide angiotensin II receptor antagonists. Synthesis and biological activity of benzimidazolecarboxylic acids. J Med Chem 36:2182-95 (1993)  
Target
Name:
Type-1 angiotensin II receptor
Synonyms:
AGTR1 Angiotensin II type 1a (AT-1a) receptor
Type:
PROTEIN
Mol. Mass.:
41107.81
Organism:
Bos taurus
Description:
ChEMBL_36779
Residue:
359
  
Inhibitor
Name:
BDBM50044405
Synonyms:
2-Propoxy-3-[2'-(1H-tetrazol-5-yl)-biphenyl-4-ylmethyl]-3H-benzoimidazole-4-carboxylic acid | CHEMBL303955
Type:
Small organic molecule
Emp. Form.:
C25H22N6O3
Mol. Mass.:
454.4806
SMILES:
CCCOc1nc2cccc(C(O)=O)c2n1Cc1ccc(cc1)-c1ccccc1-c1nnn[nH]1
: