Target
DNA topoisomerase 1
Ligand
BDBM50036133
Substrate
Meas. Tech.
ChEBML_208261
IC50
27±n/a nM
Citation
 Wall, MEWani, MCNicholas, AWManikumar, GTele, CMoore, LTruesdale, ALeitner, PBesterman, JM Plant antitumor agents. 30. Synthesis and structure activity of novel camptothecin analogs. J Med Chem 36:2689-700 (1993)  
Target
Name:
DNA topoisomerase 1
Synonyms:
DNA topoisomerase I TOP1 | TOP1_HUMAN
Type:
Enzyme
Mol. Mass.:
90771.02
Organism:
Homo sapiens (Human)
Description:
P11387
Residue:
765
  
Inhibitor
Name:
BDBM50036133
Synonyms:
7-ethyl-7-hydroxy-(7S)-7,8,11,13-tetrahydro-10H-[1,3]dioxolo[4,5-g]pyrano[3',4':6,7]indolizino[1,2-b]quinoline-8,11-dione CHEMBL307794
Type:
Small organic molecule
Emp. Form.:
C21H16N2O6
Mol. Mass.:
392.3615
SMILES:
CC[C@@]1(O)C(=O)OCc2c1cc1-c3nc4cc5OCOc5cc4cc3Cn1c2=O
: