Target
D(2) dopamine receptor
Ligand
BDBM50045636
Substrate
Meas. Tech.
ChEMBL_61755 (CHEMBL673358)
IC50
370±n/a nM
Citation
 Bøgesø, KPArnt, JHyttel, JPedersen, H Stereospecific and selective 5-HT2 antagonism in a series of 5-substituted trans-1-piperazino-3-phenylindans. J Med Chem 36:2761-70 (1993)  
Target
Name:
D(2) dopamine receptor
Synonyms:
DOPAMINE D2 DOPAMINE D2 Short Dopamine D2 receptor Drd2
Type:
G Protein-Coupled Receptor (GPCR)
Mol. Mass.:
50931.60
Organism:
Rattus norvegicus (rat)
Description:
P61169
Residue:
444
  
Inhibitor
Name:
BDBM50045636
Synonyms:
3-(2-{4-[5-Chloro-3-(4-fluoro-phenyl)-indan-1-yl]-piperazin-1-yl}-ethyl)-oxazolidin-2-one dihydrochloride | CHEMBL2111567
Type:
Small organic molecule
Emp. Form.:
C21H26Cl3FN2O
Mol. Mass.:
447.801
SMILES:
Cl.Cl.OCCN1CCN(CC1)C1CC(c2cc(Cl)ccc12)c1ccc(F)cc1
: