Target
Alpha-1A/Alpha-1B/Alpha-1D adrenergic receptor
Ligand
BDBM50029391
Substrate
Meas. Tech.
ChEMBL_30088 (CHEMBL642867)
IC50
30±n/a nM
Citation
 Bøgesø, KPArnt, JHyttel, JPedersen, H Stereospecific and selective 5-HT2 antagonism in a series of 5-substituted trans-1-piperazino-3-phenylindans. J Med Chem 36:2761-70 (1993)  
Target
Name:
Alpha-1A/Alpha-1B/Alpha-1D adrenergic receptor
Synonyms:
Adrenergic receptor alpha-1 alpha-1 Adrenergic Receptor
Type:
Mol. Mass.:
Description:
ASSAY_ID of EBI is 303470
Components:
This complex has 3 components.
Component 1
Name:
Alpha-1B adrenergic receptor
Synonyms:
ADA1B_RAT Alpha 1B-adrenoceptor Alpha adrenergic receptor 1A and 1B Alpha-1Adrenoceptor Alpha-1B adrenoreceptor | adrenergic Alpha1B
Type:
G Protein-Coupled Receptor (GPCR)
Mol. Mass.:
56606.71
Organism:
Rattus norvegicus (rat)
Description:
Receptor binding assays were performed using rat cortical membranes.
Residue:
515
  
Component 2
Name:
Alpha-1A adrenergic receptor
Synonyms:
ADA1A_RAT Adra1c Alpha-1A adrenoceptor Alpha-1C adrenergic receptor | adrenergic Alpha1A
Type:
Protein
Mol. Mass.:
51620.15
Organism:
Rattus norvegicus (Rat)
Description:
P43140
Residue:
466
  
Component 3
Name:
Alpha-1D adrenergic receptor
Synonyms:
ADA1D_RAT Adra1d Alpha-1D adrenergic receptor | Serotonin 1a (5-HT1a) receptor/Adrenergic receptor alpha-1
Type:
Protein
Mol. Mass.:
59375.97
Organism:
Rattus norvegicus (Rat)
Description:
P23944
Residue:
561
  
Inhibitor
Name:
BDBM50029391
Synonyms:
2-{4-[4-Chloro-3-(4-fluoro-phenyl)-indan-1-yl]-piperazin-1-yl}-ethanol | CHEMBL92896
Type:
Small organic molecule
Emp. Form.:
C21H24ClFN2O
Mol. Mass.:
374.879
SMILES:
OCCN1CCN(CC1)C1CC(c2c1cccc2Cl)c1ccc(F)cc1
: