Target
D(2) dopamine receptor
Ligand
BDBM50368652
Substrate
Meas. Tech.
ChEBML_61755
IC50
65±n/a nM
Citation
 Bøgesø, KPArnt, JHyttel, JPedersen, H Stereospecific and selective 5-HT2 antagonism in a series of 5-substituted trans-1-piperazino-3-phenylindans. J Med Chem 36:2761-70 (1993)  
Target
Name:
D(2) dopamine receptor
Synonyms:
DOPAMINE D2 DOPAMINE D2 Short Dopamine D2 receptor Drd2
Type:
G Protein-Coupled Receptor (GPCR)
Mol. Mass.:
50931.60
Organism:
Rattus norvegicus (rat)
Description:
P61169
Residue:
444
  
Inhibitor
Name:
BDBM50368652
Synonyms:
CHEMBL1744123
Type:
Small organic molecule
Emp. Form.:
C28H28ClFN4OS
Mol. Mass.:
523.065
SMILES:
Cc1nc2sccn2c(=O)c1CCN1CCN(CC1)C1CC(c2cc(Cl)ccc12)c1ccc(F)cc1
: