Target
D(2) dopamine receptor
Ligand
BDBM50368659
Substrate
Meas. Tech.
ChEBML_61755
IC50
230±n/a nM
Citation
 Bøgesø, KPArnt, JHyttel, JPedersen, H Stereospecific and selective 5-HT2 antagonism in a series of 5-substituted trans-1-piperazino-3-phenylindans. J Med Chem 36:2761-70 (1993)  
Target
Name:
D(2) dopamine receptor
Synonyms:
DOPAMINE D2 DOPAMINE D2 Short Dopamine D2 receptor Drd2
Type:
G Protein-Coupled Receptor (GPCR)
Mol. Mass.:
50931.60
Organism:
Rattus norvegicus (rat)
Description:
P61169
Residue:
444
  
Inhibitor
Name:
BDBM50368659
Synonyms:
CHEMBL1744112
Type:
Small organic molecule
Emp. Form.:
C24H28F2N4S
Mol. Mass.:
442.568
SMILES:
Fc1ccc(cc1)C1CC(N2CCN(CCN3CCNC3=S)CC2)c2ccc(F)cc12
: