Target
D(2) dopamine receptor
Ligand
BDBM21393
Substrate
Meas. Tech.
ChEMBL_62099 (CHEMBL674979)
Ki
1357±n/a nM
Citation
 Sonesson, CBoije, MSvensson, KEkman, ACarlsson, ARomero, AGMartin, IJDuncan, JNKing, LJWikström, H Orally active central dopamine and serotonin receptor ligands: 5-, 6-, 7-, and 8-[[trifluoromethyl)sulfonyl]oxy]-2-(di-n-propylamino)tetralins and the formation of active metabolites in vivo. J Med Chem 36:3409-16 (1993)  
Target
Name:
D(2) dopamine receptor
Synonyms:
DOPAMINE D2 DOPAMINE D2 Short Dopamine D2 receptor Drd2
Type:
G Protein-Coupled Receptor (GPCR)
Mol. Mass.:
50931.60
Organism:
Rattus norvegicus (rat)
Description:
P61169
Residue:
444
  
Inhibitor
Name:
BDBM21393
Synonyms:
7-(dipropylamino)-5,6,7,8-tetrahydronaphthalen-1-ol 8-OH-DPAT 8-OH-DPAT,(-) CHEMBL1788118 CHEMBL56 US10562853, Compound 8-OH-DPAT cid_1220
Type:
radiolabeled ligand
Emp. Form.:
C16H25NO
Mol. Mass.:
247.3758
SMILES:
CCCN(CCC)C1CCc2cccc(O)c2C1
: