Target
5-hydroxytryptamine receptor 1A
Ligand
BDBM50034366
Substrate
Meas. Tech.
ChEBML_1317
Ki
9.6±n/a nM
Citation
 Sonesson, CBoije, MSvensson, KEkman, ACarlsson, ARomero, AGMartin, IJDuncan, JNKing, LJWikström, H Orally active central dopamine and serotonin receptor ligands: 5-, 6-, 7-, and 8-[[trifluoromethyl)sulfonyl]oxy]-2-(di-n-propylamino)tetralins and the formation of active metabolites in vivo. J Med Chem 36:3409-16 (1993)  
Target
Name:
5-hydroxytryptamine receptor 1A
Synonyms:
5-HT-1A 5-HT1A 5-hydroxytryptamine receptor 1A (5HT1A) 5ht1a Htr1a Serotonin 1a (5-HT1a) receptor/Adrenergic receptor alpha-1 | Serotonin receptor 1A
Type:
G Protein-Coupled Receptor (GPCR)
Mol. Mass.:
46445.29
Organism:
Rattus norvegicus (rat)
Description:
Binding assays were performed using rat hippocampal membranes.
Residue:
422
  
Inhibitor
Name:
BDBM50034366
Synonyms:
CHEMBL28437 | Trifluoro-methanesulfonic acid 7-dipropylamino-5,6,7,8-tetrahydro-naphthalen-1-yl ester
Type:
Small organic molecule
Emp. Form.:
C17H24F3NO3S
Mol. Mass.:
379.438
SMILES:
CCCN(CCC)C1CCc2cccc(OS(=O)(=O)C(F)(F)F)c2C1
: