Target
Dual specificity calcium/calmodulin-dependent 3',5'-cyclic nucleotide phosphodiesterase 1A/1B/1C
Ligand
BDBM50038978
Substrate
Meas. Tech.
ChEMBL_217514 (CHEMBL822069)
IC50
5500±n/a nM
Citation
 Takase, YSaeki, TFujimoto, MSaito, I Cyclic GMP phosphodiesterase inhibitors. 1. The discovery of a novel potent inhibitor, 4-((3,4-(methylenedioxy)benzyl)amino)-6,7,8-trimethoxyquinazoline. J Med Chem 36:3765-70 (1994)  
Target
Name:
Dual specificity calcium/calmodulin-dependent 3',5'-cyclic nucleotide phosphodiesterase 1A/1B/1C
Synonyms:
Phosphodiesterase 1
Type:
Mol. Mass.:
Description:
Combinations of UniProts
Components:
This complex has 3 components.
Component 1
Name:
Dual specificity calcium/calmodulin-dependent 3',5'-cyclic nucleotide phosphodiesterase 1C
Synonyms:
3',5'-cyclic-AMP phosphodiesterase Calcium/calmodulin-dependent 3',5'-cyclic nucleotide phosphodiesterase 1C Hcam3 PDE1C_HUMAN Phosphodiesterase 1C | Phosphodiesterase, PDE1/PDE5
Type:
Enzyme
Mol. Mass.:
80778.58
Organism:
Homo sapiens (Human)
Description:
Q14123
Residue:
709
  
Component 2
Name:
Dual specificity calcium/calmodulin-dependent 3',5'-cyclic nucleotide phosphodiesterase 1A
Synonyms:
61 kDa Cam-PDE Cam-PDE 1A PDE1A_HUMAN | hCam-1
Type:
Protein
Mol. Mass.:
61245.69
Organism:
Homo sapiens (Human)
Description:
P54750
Residue:
535
  
Component 3
Name:
Dual specificity calcium/calmodulin-dependent 3',5'-cyclic nucleotide phosphodiesterase 1B
Synonyms:
63 kDa Cam-PDE Calcium/calmodulin-dependent 3',5'-cyclic nucleotide phosphodiesterase 1B PDE1B PDE1B_HUMAN Phosphodiesterase 1B Phosphodiesterase Type 1 (PDE1B) | Phosphodiesterase, PDE1/PDE5
Type:
Enzyme
Mol. Mass.:
61366.51
Organism:
Homo sapiens (Human)
Description:
Residue:
536
  
Inhibitor
Name:
BDBM50038978
Synonyms:
Benzo[1,3]dioxol-5-ylmethyl-(6,7,8-trimethoxy-quinazolin-4-yl)-amine | CHEMBL302299
Type:
Small organic molecule
Emp. Form.:
C19H19N3O5
Mol. Mass.:
369.3713
SMILES:
COc1cc2c(NCc3ccc4OCOc4c3)ncnc2c(OC)c1OC
: