Target
Phosphodiesterase
Ligand
BDBM50038978
Substrate
Meas. Tech.
ChEMBL_155851 (CHEMBL768897)
IC50
>100000±n/a nM
Citation
 Takase, YSaeki, TFujimoto, MSaito, I Cyclic GMP phosphodiesterase inhibitors. 1. The discovery of a novel potent inhibitor, 4-((3,4-(methylenedioxy)benzyl)amino)-6,7,8-trimethoxyquinazoline. J Med Chem 36:3765-70 (1994)  
Target
Name:
Phosphodiesterase
Synonyms:
Phosphodiesterase 3A
Type:
PROTEIN
Mol. Mass.:
108833.33
Organism:
Sus scrofa
Description:
ChEMBL_155977
Residue:
985
  
Inhibitor
Name:
BDBM50038978
Synonyms:
Benzo[1,3]dioxol-5-ylmethyl-(6,7,8-trimethoxy-quinazolin-4-yl)-amine | CHEMBL302299
Type:
Small organic molecule
Emp. Form.:
C19H19N3O5
Mol. Mass.:
369.3713
SMILES:
COc1cc2c(NCc3ccc4OCOc4c3)ncnc2c(OC)c1OC
: