Target
Beta-2 adrenergic receptor
Ligand
BDBM50042999
Substrate
Meas. Tech.
ChEBML_30208
Ki
710±n/a nM
Citation
 Chen, GTKing, MGusovsky, FCreveling, CRDaly, JWChen, BHNie, JYKirk, KL Syntheses of 2,5- and 2,6-difluoronorepinephrine, 2,5-difluoroepinephrine, and 2,6-difluorophenylephrine: effect of disubstitution with fluorine on adrenergic activity. J Med Chem 36:3947-55 (1994)  
Target
Name:
Beta-2 adrenergic receptor
Synonyms:
ADRB2_RAT Adrb2r | Adrenergic receptor beta
Type:
PROTEIN
Mol. Mass.:
46896.26
Organism:
Rattus norvegicus
Description:
ChEMBL_38603
Residue:
418
  
Inhibitor
Name:
BDBM50042999
Synonyms:
3,6-Difluoro-4-(1-hydroxy-2-methylamino-ethyl)-benzene-1,2-diol(2,5-DiFEPI) | CHEMBL126347
Type:
Small organic molecule
Emp. Form.:
C9H11F2NO3
Mol. Mass.:
219.1853
SMILES:
CNCC(O)c1cc(F)c(O)c(O)c1F
: