Target
Beta-1 adrenergic receptor
Ligand
BDBM50019059
Substrate
Meas. Tech.
ChEBML_30207
Ki
1800±n/a nM
Citation
 Chen, GTKing, MGusovsky, FCreveling, CRDaly, JWChen, BHNie, JYKirk, KL Syntheses of 2,5- and 2,6-difluoronorepinephrine, 2,5-difluoroepinephrine, and 2,6-difluorophenylephrine: effect of disubstitution with fluorine on adrenergic activity. J Med Chem 36:3947-55 (1994)  
Target
Name:
Beta-1 adrenergic receptor
Synonyms:
ADRB1R, B1AR Adrb1 Adrenergic receptor beta Beta-1 adrenoreceptor adrenergic Beta1,2
Type:
Protein
Mol. Mass.:
50486.84
Organism:
Rattus norvegicus (Rat)
Description:
P18090
Residue:
466
  
Inhibitor
Name:
BDBM50019059
Synonyms:
(+/-)3-Fluoro-4-(1-hydroxy-2-methylamino-ethyl)-benzene-1,2-diol 3-Fluoro-4-(1-hydroxy-2-methylamino-ethyl)-benzene-1,2-diol(2-FEPI) | CHEMBL43711
Type:
Small organic molecule
Emp. Form.:
C9H12FNO3
Mol. Mass.:
201.1949
SMILES:
CNCC(O)c1ccc(O)c(O)c1F
: