Target
Sodium-dependent dopamine transporter
Ligand
BDBM50043305
Substrate
Meas. Tech.
ChEMBL_62177 (CHEMBL672116)
IC50
101±n/a nM
Citation
 He, XRaymon, LPMattson, MVEldefrawi, MEde Costa, BR Further studies of the structure-activity relationships of 1-[1-(2-benzo[b]thienyl)cyclohexyl]piperidine. Synthesis and evaluation of 1-(2-benzo[b]thienyl)-N,N-dialkylcyclohexylamines at dopamine uptake and phencyclidine binding sites. J Med Chem 36:4075-81 (1994)  
Target
Name:
Sodium-dependent dopamine transporter
Synonyms:
DA transporter SC6A3_RAT Sodium-dependent dopamine transporter | Sodium-dependent dopamine transporter (DAT)
Type:
Multi-pass membrane protein
Mol. Mass.:
68749.45
Organism:
Rattus norvegicus (rat)
Description:
P23977
Residue:
619
  
Inhibitor
Name:
BDBM50043305
Synonyms:
(1-Benzo[b]thiophen-2-yl-cyclohexyl)-methyl-amine | CHEMBL335982
Type:
Small organic molecule
Emp. Form.:
C15H19NS
Mol. Mass.:
245.383
SMILES:
CNC1(CCCCC1)c1cc2ccccc2s1
: