Target
Endothelin receptor type B
Ligand
BDBM50043326
Substrate
Meas. Tech.
ChEMBL_63515 (CHEMBL677265)
IC50
0.093000±n/a nM
Citation
 Kikuchi, TKubo, KOhtaki, TSuzuki, NAsami, TShimamoto, NWakimasu, MFujino, M Endothelin-1 analogues substituted at both position 18 and 19: highly potent endothelin antagonists with no selectivity for either receptor subtype ETA or ETB. J Med Chem 36:4087-93 (1994)  
Target
Name:
Endothelin receptor type B
Synonyms:
EDNRB Endothelin receptor ET-B
Type:
PROTEIN
Mol. Mass.:
49389.50
Organism:
Bos taurus
Description:
ChEMBL_63513
Residue:
441
  
Inhibitor
Name:
BDBM50043326
Synonyms:
CHEMBL438733 | c(Cys-Ser-Cys)-Ser-Ser-Leu-Met-Asp-Lys-Gln-c(Cys-Val-Tyr-Phe-Cys)-His-Leu-Asp-Ile-Ile-Trp
Type:
Small organic molecule
Emp. Form.:
C109H159N25O32S5
Mol. Mass.:
2491.902
SMILES:
CC[C@H](C)[C@H](NC(=O)[C@H](CC(O)=O)NC(=O)[C@H](CC(C)C)NC(=O)[C@H](Cc1cnc[nH]1)NC(=O)[C@@H]1CSSC[C@@H](NC(=O)[C@H](CCC(O)=O)NC(=O)[C@@H](CCCCN)NC(=O)[C@H](CC(O)=O)NC(=O)[C@@H](CCSC)NC(=O)[C@H](CC(C)C)NC(=O)[C@@H](CO)NC(=O)[C@H](CO)NC(=O)[C@H]2CSSC[C@@H](N)C(=O)N[C@@H](CO)C(=O)N2)C(=O)N[C@@H](C(C)C)C(=O)N[C@H](Cc2ccc(O)cc2)C(=O)N[C@@H](Cc2ccccc2)C(=O)N1)C(=O)N[C@@H]([C@@H](C)CC)C(=O)N[C@@H](Cc1c[nH]c2ccccc12)C(O)=O
: