Target
Cholecystokinin receptor type A
Ligand
BDBM50456289
Substrate
Meas. Tech.
ChEMBL_50185 (CHEMBL662400)
IC50
60±n/a nM
Citation
 Bock, MGDiPardo, RMEvans, BERittle, KEWhitter, WLGarsky, VMGilbert, KFLeighton, JLCarson, KLMellin, EC Development of 1,4-benzodiazepine cholecystokinin type B antagonists. J Med Chem 36:4276-92 (1994)  
Target
Name:
Cholecystokinin receptor type A
Synonyms:
CCKAR_RAT Cholecystokinin peripheral Cholecystokinin receptor type A
Type:
Enzyme Catalytic Domain
Mol. Mass.:
49676.37
Organism:
RAT
Description:
Cholecystokinin central 0 RAT::P30551
Residue:
444
  
Inhibitor
Name:
BDBM50456289
Synonyms:
CHEMBL2112753
Type:
Small organic molecule
Emp. Form.:
C23H20N4O3
Mol. Mass.:
400.4299
SMILES:
CN1c2ccccc2C(=N[C@@H](NC(=O)Nc2cccc(O)c2)C1=O)c1ccccc1
: