Target
Gastrin/cholecystokinin type B receptor
Ligand
BDBM50456330
Substrate
Meas. Tech.
ChEMBL_48257 (CHEMBL662868)
IC50
13±n/a nM
Citation
 Boden, PRHigginbottom, MHill, DRHorwell, DCHughes, JRees, DCRoberts, ESingh, LSuman-Chauhan, NWoodruff, GN Cholecystokinin dipeptoid antagonists: design, synthesis, and anxiolytic profile of some novel CCK-A and CCK-B selective and"mixed" CCK-A/CCK-B antagonists. J Med Chem 36:552-65 (1993)  
Target
Name:
Gastrin/cholecystokinin type B receptor
Synonyms:
Cckbr Cholecystokinin receptor Gastrin/cholecystokinin type B receptor
Type:
Enzyme Catalytic Domain
Mol. Mass.:
49196.59
Organism:
MOUSE
Description:
Cholecystokinin A CCKBR MOUSE::P56481
Residue:
453
  
Inhibitor
Name:
BDBM50456330
Synonyms:
CHEMBL2304064
Type:
Small organic molecule
Emp. Form.:
C33H39N3O5
Mol. Mass.:
557.6799
SMILES:
[H][C@@]12C[C@@]3([H])C[C@@]([H])(C1)C(OC(=O)N[C@@](C)(Cc1c[nH]c4ccccc14)C(=O)N[C@H](CC(O)=O)Cc1ccccc1)[C@@]([H])(C2)C3
: