Target
Gastrin/cholecystokinin type B receptor
Ligand
BDBM50033605
Substrate
Meas. Tech.
ChEMBL_48257 (CHEMBL662868)
IC50
13±n/a nM
Citation
 Boden, PRHigginbottom, MHill, DRHorwell, DCHughes, JRees, DCRoberts, ESingh, LSuman-Chauhan, NWoodruff, GN Cholecystokinin dipeptoid antagonists: design, synthesis, and anxiolytic profile of some novel CCK-A and CCK-B selective and"mixed" CCK-A/CCK-B antagonists. J Med Chem 36:552-65 (1993)  
Target
Name:
Gastrin/cholecystokinin type B receptor
Synonyms:
Cckbr Cholecystokinin receptor Gastrin/cholecystokinin type B receptor
Type:
Enzyme Catalytic Domain
Mol. Mass.:
49196.59
Organism:
MOUSE
Description:
Cholecystokinin A CCKBR MOUSE::P56481
Residue:
453
  
Inhibitor
Name:
BDBM50033605
Synonyms:
CHEMBL436065 | N-{2-[3-(1H-Indol-3-yl)-2-methyl-2-(2-methyl-cyclohexyloxycarbonylamino)-propionylamino]-3-phenyl-propyl}-succinamic acid
Type:
Small organic molecule
Emp. Form.:
C33H42N4O6
Mol. Mass.:
590.7098
SMILES:
C[C@H]1CCCCC1OC(=O)N[C@](C)(Cc1c[nH]c2ccccc12)C(=O)N[C@H](CNC(=O)CCC(O)=O)Cc1ccccc1
: