Target
Gastrin/cholecystokinin type B receptor
Ligand
BDBM50033607
Substrate
Meas. Tech.
ChEMBL_48257 (CHEMBL662868)
IC50
6.3±n/a nM
Citation
 Boden, PRHigginbottom, MHill, DRHorwell, DCHughes, JRees, DCRoberts, ESingh, LSuman-Chauhan, NWoodruff, GN Cholecystokinin dipeptoid antagonists: design, synthesis, and anxiolytic profile of some novel CCK-A and CCK-B selective and"mixed" CCK-A/CCK-B antagonists. J Med Chem 36:552-65 (1993)  
Target
Name:
Gastrin/cholecystokinin type B receptor
Synonyms:
Cckbr Cholecystokinin receptor Gastrin/cholecystokinin type B receptor
Type:
Enzyme Catalytic Domain
Mol. Mass.:
49196.59
Organism:
MOUSE
Description:
Cholecystokinin A CCKBR MOUSE::P56481
Residue:
453
  
Inhibitor
Name:
BDBM50033607
Synonyms:
Adamantane-2-carboxylic acid [1-(1-hydroxymethyl-2-phenyl-ethylcarbamoyl)-2-(1H-indol-3-yl)-1-methyl-ethyl]-amide | CHEMBL357564
Type:
Small organic molecule
Emp. Form.:
C32H39N3O3
Mol. Mass.:
513.6704
SMILES:
C[C@](Cc1c[nH]c2ccccc12)(NC(=O)C1C2CC3CC(C2)CC1C3)C(=O)N[C@H](CO)Cc1ccccc1
: