Target
5-hydroxytryptamine receptor 3A/3B
Ligand
BDBM50047887
Substrate
Meas. Tech.
ChEMBL_3237 (CHEMBL618923)
Ki
58±n/a nM
Citation
 Hayashi, HMiwa, YIchikawa, SYoda, NMiki, IIshii, AKono, MYasuzawa, TSuzuki, F 5-HT3 receptor antagonists. 2. 4-Hydroxy-3-quinolinecarboxylic acid derivatives. J Med Chem 36:617-26 (1993)  
Target
Name:
5-hydroxytryptamine receptor 3A/3B
Synonyms:
Serotonin 3 (5-HT3) receptor | Serotonin 3a (5-HT3a)/3b (5-HT3b) receptor
Type:
Mol. Mass.:
Description:
ASSAY_ID of EBI is 2974
Components:
This complex has 2 components.
Component 1
Name:
5-hydroxytryptamine receptor 3B
Synonyms:
5HT3B_RAT Serotonin (5-HT) receptor
Type:
PROTEIN
Mol. Mass.:
50328.78
Organism:
Rattus norvegicus
Description:
EBI_11885
Residue:
437
  
Component 2
Name:
5-hydroxytryptamine receptor 3A
Synonyms:
5-HT3 5HT3A_RAT Htr3 Serotonin (5-HT) receptor | Zacopride site-R
Type:
Enzyme Catalytic Domain
Mol. Mass.:
55428.70
Organism:
RAT
Description:
5-HT3 HTR3A RAT::P35563
Residue:
483
  
Inhibitor
Name:
BDBM50047887
Synonyms:
4-Hydroxy-2-methyl-quinoline-3-carboxylic acid 8-methyl-8-aza-bicyclo[3.2.1]oct-3-yl ester | CHEMBL158895
Type:
Small organic molecule
Emp. Form.:
C19H22N2O3
Mol. Mass.:
326.3896
SMILES:
CN1C2CCC1CC(C2)OC(=O)c1c(C)nc2ccccc2c1O
: