Target
Purine nucleoside phosphorylase
Ligand
BDBM50046864
Substrate
Meas. Tech.
ChEMBL_153326 (CHEMBL760478)
Ki
10000±n/a nM
Citation
 Chern, JWLee, HYChen, CSShewach, DSDaddona, PETownsend, LB Nucleosides. 5. Synthesis of guanine and formycin B derivatives as potential inhibitors of purine nucleoside phosphorylase. J Med Chem 36:1024-31 (1993)  
Target
Name:
Purine nucleoside phosphorylase
Synonyms:
Inosine phosphorylase NP PNPH_HUMAN | Purine nucleoside phosphorylase (PNPase)
Type:
Enzyme
Mol. Mass.:
32119.53
Organism:
Homo sapiens (Human)
Description:
Residue:
289
  
Inhibitor
Name:
BDBM50046864
Synonyms:
6-(2,8-Diamino-6-oxo-1,6-dihydro-purin-9-yl)-hexanoic acid | CHEMBL8246
Type:
Small organic molecule
Emp. Form.:
C11H16N6O3
Mol. Mass.:
280.2831
SMILES:
Nc1nc2c(nc(N)[nH]c2=O)n1CCCCCC(O)=O
: