Target
Purine nucleoside phosphorylase
Ligand
BDBM50368823
Substrate
Meas. Tech.
ChEMBL_153329 (CHEMBL760481)
Ki
7000±n/a nM
Citation
 Chern, JWLee, HYChen, CSShewach, DSDaddona, PETownsend, LB Nucleosides. 5. Synthesis of guanine and formycin B derivatives as potential inhibitors of purine nucleoside phosphorylase. J Med Chem 36:1024-31 (1993)  
Target
Name:
Purine nucleoside phosphorylase
Synonyms:
Inosine phosphorylase NP PNPH_HUMAN | Purine nucleoside phosphorylase (PNPase)
Type:
Enzyme
Mol. Mass.:
32119.53
Organism:
Homo sapiens (Human)
Description:
Residue:
289
  
Inhibitor
Name:
BDBM50368823
Synonyms:
CHEMBL606329
Type:
Small organic molecule
Emp. Form.:
C9H9IN4O4
Mol. Mass.:
364.0966
SMILES:
O[C@@H]1[C@@H](I)OC([C@@H]1O)c1[nH]nc2c1nc[nH]c2=O
: