Target
Translocator protein
Ligand
BDBM50041483
Substrate
Meas. Tech.
ChEMBL_37232 (CHEMBL651688)
IC50
8±n/a nM
Citation
 Fiorini, INacci, VCiani, SMGarofalo, ACampiani, GSavini, LNovellino, EGreco, GBernasconi, PMennini, T Novel ligands specific for mitochondrial benzodiazepine receptors: 6-arylpyrrolo[2,1-d][1,5]benzothiazepine derivatives. Synthesis, structure-activity relationships, and molecular modeling studies. J Med Chem 37:1427-38 (1994)  
Target
Name:
Translocator protein
Synonyms:
Benzodiazepine receptors; peripheral & central Mbr PBR Peripheral benzodiazepine receptor (PBR) TSPO_RAT | Tspo
Type:
Mitochondrion membrane protein
Mol. Mass.:
18945.84
Organism:
Rattus norvegicus (rat)
Description:
Competitive binding experiments were performed on rat kidney mitochondrial membranes.
Residue:
169
  
Inhibitor
Name:
BDBM50041483
Synonyms:
Acetic acid 7-chloro-5-phenyl-6-thia-10b-aza-benzo[e]azulen-4-yl ester | CHEMBL285078
Type:
Small organic molecule
Emp. Form.:
C20H14ClNO2S
Mol. Mass.:
367.849
SMILES:
CC(=O)OC1=C(Sc2c(Cl)cccc2-n2cccc12)c1ccccc1
: