Target
Translocator protein
Ligand
BDBM50041508
Substrate
Meas. Tech.
ChEMBL_37232 (CHEMBL651688)
IC50
48±n/a nM
Citation
 Fiorini, INacci, VCiani, SMGarofalo, ACampiani, GSavini, LNovellino, EGreco, GBernasconi, PMennini, T Novel ligands specific for mitochondrial benzodiazepine receptors: 6-arylpyrrolo[2,1-d][1,5]benzothiazepine derivatives. Synthesis, structure-activity relationships, and molecular modeling studies. J Med Chem 37:1427-38 (1994)  
Target
Name:
Translocator protein
Synonyms:
Benzodiazepine receptors; peripheral & central Mbr PBR Peripheral benzodiazepine receptor (PBR) TSPO_RAT | Tspo
Type:
Mitochondrion membrane protein
Mol. Mass.:
18945.84
Organism:
Rattus norvegicus (rat)
Description:
Competitive binding experiments were performed on rat kidney mitochondrial membranes.
Residue:
169
  
Inhibitor
Name:
BDBM50041508
Synonyms:
CHEMBL416040 | Pentanoic acid 5-phenyl-6-thia-10b-aza-benzo[e]azulen-4-yl ester
Type:
Small organic molecule
Emp. Form.:
C23H21NO2S
Mol. Mass.:
375.483
SMILES:
CCCCC(=O)OC1=C(Sc2ccccc2-n2cccc12)c1ccccc1
: