Target
Muscarinic acetylcholine receptor M2
Ligand
BDBM50041518
Substrate
Meas. Tech.
ChEMBL_140094 (CHEMBL752971)
EC50
4500±n/a nM
Citation
 Botero Cid, MHHolzgrabe, UKostenis, EMohr, KTränkle, C Search for the pharmacophore of bispyridinium-type allosteric modulators of muscarinic receptors. J Med Chem 37:1439-45 (1994)  
Target
Name:
Muscarinic acetylcholine receptor M2
Synonyms:
ACM2_PIG Cholinergic, muscarinic LOC100715343 Muscarinic receptor 2
Type:
Enzyme Catalytic Domain
Mol. Mass.:
51688.65
Organism:
GUINEA PIG
Description:
Cholinergic, muscarinic 0 GUINEA PIG::P06199
Residue:
466
  
Inhibitor
Name:
BDBM50041518
Synonyms:
4-((E)-{[(2,6-dichlorobenzyl)oxy]imino}methyl)-1-propyl-3yl-(4-(Methoxyimino-methyl)-pyridinium)pyridinium | CHEMBL33656
Type:
Small organic molecule
Emp. Form.:
C23H24Cl2N4O2
Mol. Mass.:
459.367
SMILES:
CO\N=C\c1cc[n+](CCC[n+]2ccc(\C=N\OCc3c(Cl)cccc3Cl)cc2)cc1
: