Target
Acyl-CoA:cholesterol acyltransferase
Ligand
BDBM50041738
Substrate
Meas. Tech.
ChEMBL_28198 (CHEMBL637691)
IC50
15±n/a nM
Citation
 Trivedi, BKPurchase, TSHolmes, AAugelli-Szafran, CEEssenburg, ADHamelehle, KLStanfield, RLBousley, RFKrause, BR Inhibitors of acyl-CoA:cholesterol acyltransferase (ACAT). 7. Development of a series of substituted N-phenyl-N'-[(1-phenylcyclopentyl)methyl]ureas with enhanced hypocholesterolemic activity. J Med Chem 37:1652-9 (1994)  
Target
Name:
Acyl-CoA:cholesterol acyltransferase
Synonyms:
ACAT
Type:
Mol. Mass.:
35405.31
Organism:
Oryctolagus cuniculus
Description:
Residue:
305
  
Inhibitor
Name:
BDBM50041738
Synonyms:
1-(2,6-Diisopropyl-phenyl)-3-[1-(3-hydroxymethyl-phenyl)-cyclopentylmethyl]-urea | CHEMBL46676
Type:
Small organic molecule
Emp. Form.:
C26H36N2O2
Mol. Mass.:
408.5762
SMILES:
CC(C)c1cccc(C(C)C)c1NC(=O)NCC1(CCCC1)c1cccc(CO)c1
: