Target
Acyl-CoA:cholesterol acyltransferase
Ligand
BDBM50041728
Substrate
Meas. Tech.
ChEMBL_28198 (CHEMBL637691)
IC50
620±n/a nM
Citation
 Trivedi, BKPurchase, TSHolmes, AAugelli-Szafran, CEEssenburg, ADHamelehle, KLStanfield, RLBousley, RFKrause, BR Inhibitors of acyl-CoA:cholesterol acyltransferase (ACAT). 7. Development of a series of substituted N-phenyl-N'-[(1-phenylcyclopentyl)methyl]ureas with enhanced hypocholesterolemic activity. J Med Chem 37:1652-9 (1994)  
Target
Name:
Acyl-CoA:cholesterol acyltransferase
Synonyms:
ACAT
Type:
Mol. Mass.:
35405.31
Organism:
Oryctolagus cuniculus
Description:
Residue:
305
  
Inhibitor
Name:
BDBM50041728
Synonyms:
3-{1-[3-(2,6-Diisopropyl-phenyl)-ureidomethyl]-cyclopentyl}-benzoic acid | CHEMBL433472
Type:
Small organic molecule
Emp. Form.:
C26H34N2O3
Mol. Mass.:
422.5598
SMILES:
CC(C)c1cccc(C(C)C)c1NC(=O)NCC1(CCCC1)c1cccc(c1)C(O)=O
: