Target
Adenosine receptor A1
Ligand
BDBM50453346
Substrate
Meas. Tech.
ChEMBL_28395 (CHEMBL636814)
EC50
167±n/a nM
Citation
 Cristalli, GVolpini, RVittori, SCamaioni, EMonopoli, AConti, ADionisotti, SZocchi, COngini, E 2-Alkynyl derivatives of adenosine-5'-N-ethyluronamide: selective A2 adenosine receptor agonists with potent inhibitory activity on platelet aggregation. J Med Chem 37:1720-6 (1994)  
Target
Name:
Adenosine receptor A1
Synonyms:
AA1R_RAT ADENOSINE A1 high Adenosine A1 receptor (A1) Adenosine receptors A1 | Adora1
Type:
Protein
Mol. Mass.:
36704.13
Organism:
Rattus norvegicus (rat)
Description:
Residue:
326
  
Inhibitor
Name:
BDBM50453346
Synonyms:
CHEMBL2113449
Type:
Small organic molecule
Emp. Form.:
C14H16N6O4
Mol. Mass.:
332.3146
SMILES:
CCNC(=O)[C@H]1O[C@H]([C@H](O)[C@@H]1O)n1cnc2c(N)nc(nc12)C#C
: