Target
Delta-type opioid receptor
Ligand
BDBM50038422
Substrate
Meas. Tech.
ChEMBL_145767 (CHEMBL752785)
IC50
211±n/a nM
Citation
 Qian, XKövér, KEShenderovich, MDLou, BSMisicka, AZalewska, THorváth, RDavis, PBilsky, EJPorreca, F Newly discovered stereochemical requirements in the side-chain conformation of delta opioid agonists for recognizing opioid delta receptors. J Med Chem 37:1746-57 (1994)  
Target
Name:
Delta-type opioid receptor
Synonyms:
DOR-1 MSL-2 OPRD_MOUSE Oprd1
Type:
Enzyme Catalytic Domain
Mol. Mass.:
40577.25
Organism:
MOUSE
Description:
P32300
Residue:
372
  
Inhibitor
Name:
BDBM50038422
Synonyms:
(4S,7S,13S)-13-[(2S,3S)-2-Amino-3-(4-hydroxy-2,6-dimethyl-phenyl)-butyrylamino]-7-benzyl-3,3,14,14-tetramethyl-6,9,12-trioxo-1,2-dithia-5,8,11-triaza-cyclotetradecane-4-carboxylic acid | CHEMBL50284
Type:
Small organic molecule
Emp. Form.:
C33H45N5O7S2
Mol. Mass.:
687.87
SMILES:
C[C@H]([C@H](N)C(=O)N[C@H]1C(=O)NCC(=O)N[C@@H](Cc2ccccc2)C(=O)N[C@@H](C(O)=O)C(C)(C)SSC1(C)C)c1c(C)cc(O)cc1C
: