Target
D(2) dopamine receptor
Ligand
BDBM50036857
Substrate
Meas. Tech.
ChEMBL_59314 (CHEMBL670208)
IC50
10±n/a nM
Citation
 Podona, TGuardiola-Lemaître, BCaignard, DHAdam, GPfeiffer, BRenard, PGuillaumet, G 3,4-Dihydro-3-amino-2H-1-benzopyran derivatives as 5-HT1A receptor ligands and potential anxiolytic agents. 1. Synthesis and structure--activity relationship studies. J Med Chem 37:1779-93 (1994)  
Target
Name:
D(2) dopamine receptor
Synonyms:
DOPAMINE D2 DRD2_BOVIN | Dopamine D2 receptor
Type:
Enzyme Catalytic Domain
Mol. Mass.:
50698.79
Organism:
BOVINE
Description:
P20288
Residue:
444
  
Inhibitor
Name:
BDBM50036857
Synonyms:
2-Methoxy-N-{4-[(5-methoxy-chroman-3-yl)-propyl-amino]-butyl}-benzamide; compound with oxalic acid | CHEMBL48925
Type:
Small organic molecule
Emp. Form.:
C25H34N2O4
Mol. Mass.:
426.5485
SMILES:
CCCN(CCCCNC(=O)c1ccccc1OC)C1COc2cccc(OC)c2C1
: