Target
Alpha-2A adrenergic receptor
Ligand
BDBM50036870
Substrate
Meas. Tech.
ChEMBL_33026 (CHEMBL643951)
IC50
20000±n/a nM
Citation
 Podona, TGuardiola-Lemaître, BCaignard, DHAdam, GPfeiffer, BRenard, PGuillaumet, G 3,4-Dihydro-3-amino-2H-1-benzopyran derivatives as 5-HT1A receptor ligands and potential anxiolytic agents. 1. Synthesis and structure--activity relationship studies. J Med Chem 37:1779-93 (1994)  
Target
Name:
Alpha-2A adrenergic receptor
Synonyms:
ADA2A_BOVIN Alpha-2A adrenergic receptor Alpha-2A adrenoreceptor Alpha-2D adrenergic receptor Cerebral cortex alpha adrenergic receptor adrenergic Alpha2D
Type:
Enzyme Catalytic Domain
Mol. Mass.:
49275.13
Organism:
BOVINE
Description:
adrenergic Alpha2 0 BOVINE::Q28838
Residue:
452
  
Inhibitor
Name:
BDBM50036870
Synonyms:
8-[4-(5-Methoxy-chroman-3-ylamino)-butyl]-8-aza-spiro[4.5]decane-7,9-dione; compound with oxalic acid | CHEMBL52785
Type:
Small organic molecule
Emp. Form.:
C23H32N2O4
Mol. Mass.:
400.5112
SMILES:
COc1cccc2OCC(Cc12)NCCCCN1C(=O)CC2(CCCC2)CC1=O
: