Target
D(1A) dopamine receptor
Ligand
BDBM50036845
Substrate
Meas. Tech.
ChEMBL_60191 (CHEMBL674902)
IC50
>1000000±n/a nM
Citation
 Podona, TGuardiola-Lemaître, BCaignard, DHAdam, GPfeiffer, BRenard, PGuillaumet, G 3,4-Dihydro-3-amino-2H-1-benzopyran derivatives as 5-HT1A receptor ligands and potential anxiolytic agents. 1. Synthesis and structure--activity relationship studies. J Med Chem 37:1779-93 (1994)  
Target
Name:
D(1A) dopamine receptor
Synonyms:
D(1A) dopamine receptor DOPAMINE D1 DRD1_BOVIN | Dopamine receptor
Type:
Enzyme Catalytic Domain
Mol. Mass.:
49330.65
Organism:
BOVINE
Description:
DOPAMINE D1 DRD1 BOVINE::Q95136
Residue:
446
  
Inhibitor
Name:
BDBM50036845
Synonyms:
2-{2-[(5-Methoxy-chroman-3-yl)-propyl-amino]-ethyl}-isoindole-1,3-dione; hydrochloride | CHEMBL545198
Type:
Small organic molecule
Emp. Form.:
C23H26N2O4
Mol. Mass.:
394.4635
SMILES:
CCCN(CCN1C(=O)c2ccccc2C1=O)C1COc2cccc(OC)c2C1
: