Target
Alpha-1A adrenergic receptor
Ligand
BDBM50036847
Substrate
Meas. Tech.
ChEMBL_32974 (CHEMBL644689)
IC50
3000±n/a nM
Citation
 Podona, TGuardiola-Lemaître, BCaignard, DHAdam, GPfeiffer, BRenard, PGuillaumet, G 3,4-Dihydro-3-amino-2H-1-benzopyran derivatives as 5-HT1A receptor ligands and potential anxiolytic agents. 1. Synthesis and structure--activity relationship studies. J Med Chem 37:1779-93 (1994)  
Target
Name:
Alpha-1A adrenergic receptor
Synonyms:
ADA1A_BOVIN ADRA1C Alpha 1A-adrenoreceptor Cerebral cortex alpha adrenergic receptor | adrenergic Alpha1
Type:
Enzyme Catalytic Domain
Mol. Mass.:
51492.08
Organism:
CALF
Description:
adrenergic Alpha1 0 CALF
Residue:
466
  
Inhibitor
Name:
BDBM50036847
Synonyms:
CHEMBL54266 | N-{3-[(5-Methoxy-chroman-3-yl)-propyl-amino]-propyl}-4-methyl-benzenesulfonamide; compound with oxalic acid
Type:
Small organic molecule
Emp. Form.:
C23H32N2O4S
Mol. Mass.:
432.576
SMILES:
CCCN(CCCNS(=O)(=O)c1ccc(C)cc1)C1COc2cccc(OC)c2C1
: