Target
Sterol O-acyltransferase 1
Ligand
BDBM50038526
Substrate
Meas. Tech.
ChEMBL_28340 (CHEMBL646540)
IC50
17±n/a nM
Citation
 O'Brien, PMSliskovic, DRBlankley, CJRoth, BDWilson, MWHamelehle, KLKrause, BRStanfield, RL Inhibitors of acyl-CoA:cholesterol O-acyl transferase (ACAT) as hypocholesterolemic agents. 8. Incorporation of amide or amine functionalities into a series of disubstituted ureas and carbamates. Effects on ACAT inhibition in vitro and efficacy in vivo. J Med Chem 37:1810-22 (1994)  
Target
Name:
Sterol O-acyltransferase 1
Synonyms:
ACAT-1 Acat SOAT1_RAT Sterol O-acyltransferase, Soat
Type:
PROTEIN
Mol. Mass.:
64165.56
Organism:
Rattus norvegicus
Description:
ChEMBL_28796
Residue:
545
  
Inhibitor
Name:
BDBM50038526
Synonyms:
1-(2,6-Diisopropyl-phenyl)-3-(1-phenyl-cyclopentylmethyl)-urea PD-129337
Type:
Small organic molecule
Emp. Form.:
C25H34N2O
Mol. Mass.:
378.5503
SMILES:
CC(C)c1cccc(C(C)C)c1NC(=O)NCC1(CCCC1)c1ccccc1
: